{"text_format":"1","workbook":"xlsx","n_sheets":3,"sheets":["GTA","Papier","Pilotage"],"not_rendered":{"charts":0,"images":0,"macros":1,"external_links":0,"defined_names":22,"comments":0,"pivot_tables":0},"unopened":[],"bounds":{"document_bytes":16777216,"sheet_cells":100000,"rows_first":2000,"rows_last":500,"rows_between":2000,"halvings":0,"cell_chars":16384,"cell_head_chars":4096},"cells_cut":0,"cells_raw":0,"read":"whole","date_system":"1900"}

{"sheet":"GTA","index":0,"n_rows":74,"n_cols":18,"rows_kept":74,"cut":false,"hidden":false,"merged":[[0,17,0,19],[3,17,3,18]]}
["RANG","JOUEUR","TRS","PJ","IPS","FP","% VIC","DIFF","ERO","EC","TVP","Équipe",null,null,"Patrick Giroux","$B$3",null,"Indiquez votre nom dans la case Personne sondée.\nDéléguez cinq joueurs qui ne font pas partie de votre équipe à qui vous feriez confiance pour faire partie du comité de cotation. \n\nTrier les joueurs du plus fort (1er rang) au plus faible (dernier rang).\n- Sélectionnez un joueur dans la liste.\n- Pour le monter, utilisez la combinaison de touche CTRL+H ou bouton +.\n- Pour le descendre, utilisez la combinaison de touche CTRL+B ou bouton -."]
[null,1,2,3,4,5,6,7,8,9,10,11]
[1,"Patrick Giroux",{"$f":"VLOOKUP($B3,PIL_STAT,C$2,FALSE)","v":60},64,639,"7.03","70.3",182,7,0,8,"The Gentlemen"]
[2,"Samuel Paquet",{"$f":"VLOOKUP($B4,PIL_STAT,C$2,FALSE)","v":60},56,629,"6.94","67.9",118,6,2,7,"Maiden",null,null,"Personne sondée",null,null,"Proposition de comité"]
[3,"Réal Jobin",60,64,574,"6.41","57.8",101,5,3,6,"L'équipe à Pat",null,null,null,null,null,"Joueur #1"]
[4,"Pascal St-Louis",60,72,508,"5.84","56.9",45,2,2,2,"On revient avec ça",null,null,null,null,null,"Joueur #2"]
[5,"Sébastien Picard (Québec)",70,64,692,"7.52","76.6",213,8,1,8,"Young Blood",null,null,null,null,null,"Joueur #3"]
[6,"Rita Fortin",70,40,636,"6.97","72.5",110,2,1,2,"Les Bikers",null,null,null,null,null,"Joueur #4"]
[7,"Michel Bergeron",70,72,579,"6.46","61.1",109,6,2,8,"Les Bikers",null,null,null,null,null,"Joueur #5"]
[8,"Dave-Tom Gosselin",70,72,561,"6.29","63.9",113,2,1,2,"Kin Toé"]
[9,"Marco Lehoux",70,72,560,"6.31","61.1",85,3,2,5,"Les Beaux Seront"]
[10,"Frédéric Vallières",70,72,530,"6.13","55.6",32,2,5,2,"Les Assoiffés du billard"]
[11,"Gilles Rousseau",70,72,516,"5.98","58.3",56,1,3,2,"Team Marvel"]
[12,"Jean Metivier",70,64,495,"5.80","51.6",23,3,2,4,"Les Beaux Seront"]
[13,"Martin Villeneuve",70,72,493,"5.75","51.4",30,4,2,4,"Isa et ses requins"]
[14,"Stéphane Desroches",70,64,481,"5.58","51.6",17,1,2,2,"Black Wolves"]
[15,"Guy Boivin",70,72,465,"5.51","50.0",8,2,2,2,"Serial Killer"]
[16,"Patrick Saindon",70,40,431,"5.27","47.5",-19,1,1,1,"On revient avec ça"]
[17,"Sébastien Touchette",80,64,659,"7.30","70.3",166,8,3,8,"Black Wolves"]
[18,"Yves Picard",80,48,602,"6.72","70.8",106,2,0,3,"Young Blood"]
[19,"Dave Beaulieu",80,64,586,"6.67","67.2",112,5,1,5,"Attache ta tuque"]
[20,"Daniel Bujold",80,72,571,"6.39","63.9",117,2,2,2,"Black Wolves"]
[21,"Jocelyn Laperrière",80,72,536,"6.14","58.3",80,3,2,3,"Attache ta tuque"]
[22,"Audrey Girard-Gagnon",80,64,533,"6.14","62.5",54,1,2,1,"Les Sans Carlito"]
[23,"Marco Raby",80,72,524,"5.93","56.9",51,2,2,3,"Les Panzers"]
[24,"Maxime Larochelle-Tardif",80,72,513,"5.93","56.9",38,1,4,1,"Sortie 274"]
[25,"Pascal Gravel",80,72,492,"5.85","54.2",20,2,3,2,"Team Marvel"]
[26,"Garry Conroy",80,72,483,"5.69","54.2",{"$f":"VLOOKUP($B28,PIL_STAT,H$2,FALSE)","v":34},2,0,2,"Les Assoiffés du billard"]
[27,"Jean-Philippe Langlois",{"$f":"VLOOKUP($B29,PIL_STAT,C$2,FALSE)","v":80},64,480,"5.63","53.1",21,0,2,0,"Kin Toé"]
[28,"Julien Petitclerc",80,72,480,"5.68","50.0",13,4,2,4,"Attache ta tuque"]
[29,"Denis Roy",80,64,468,"5.58","53.1",0,1,2,1,"The Gentlemen"]
[30,"Mélanie Roussin",80,56,466,"5.44","48.2",-3,2,1,2,"Les Sans Carlito"]
[31,"Michel Belley",80,16,451,"5.34","50.0",2,0,0,0,"Young Blood"]
[32,"Jean-Philippe Ross",80,64,446,"5.41","50.0",-16,1,2,1,"Team Marvel"]
[33,"Isabelle Nadeau",{"$f":"VLOOKUP($B35,PIL_STAT,C$2,FALSE)","v":80},64,442,"5.30","45.3",-22,1,2,1,"Isa et ses requins"]
[34,"André Nadeau",80,72,437,"5.27","45.8",-46,2,4,2,"Attache ta tuque"]
[35,"Sylvain Bernard",80,56,436,"5.27","44.6",-35,2,3,2,"Serial Killer"]
[36,"Alexandre Laroche",80,72,435,"5.24","44.4",-38,2,2,3,"Isa et ses requins"]
[37,"Alain Martel",80,56,432,"5.26","44.6",-37,1,2,1,"Sortie 274"]
[38,"Denis Légaré",80,72,422,"5.10","44.4",-67,0,4,1,"Sortie 274"]
[39,"Mickael Savard",80,72,399,"5.00","41.7",-77,1,3,1,"Les Panzers"]
[40,"Manon Huet",80,56,389,"4.88","41.1",-57,1,1,1,"Les Sans Carlito"]
[41,"Martin Conroy",80,72,381,"4.83","40.3",-83,1,0,1,"Les Assoiffés du billard"]
[42,"Claude Tardif",80,56,374,"4.77","37.5",-92,0,4,0,"Sortie 274"]
[43,"Nelson Dubois",80,56,364,"4.61","32.1",-102,0,3,0,"Serial Killer"]
[44,"Steve Lebrasseur",80,64,351,"4.55","32.8",-101,1,1,1,"L'équipe à Pat"]
[45,"Stéphane Laliberté",90,72,567,"6.44","62.5",86,3,4,4,"Isa et ses requins"]
[46,"Martin Lemieux",90,48,519,"5.89","56.3",32,2,1,3,"Les Beaux Seront"]
[47,"Mariline Boutet",90,64,507,"5.98","54.7",18,3,3,3,"On revient avec ça"]
[48,"Denise Paquin (St-Henri)",90,40,480,"5.74","50.0",23,1,0,1,"Les Sans Carlito"]
[49,"Dany Trépanier",{"$f":"VLOOKUP($B51,PIL_STAT,C$2,FALSE)","v":90},64,470,"5.71","46.9",-39,3,6,3,"L'équipe à Pat"]
[50,"Marie-Noël Naud",90,72,468,"5.52","51.4",4,0,2,0,"Kin Toé"]
[51,"Pierre Lemay",90,64,465,"5.50","51.6",1,0,2,0,"Team Marvel"]
[52,"Daniel Gauthier",90,72,459,"5.46","50.0",5,1,2,1,"The Gentlemen"]
[53,"Jordan Cayer",90,72,450,"5.20","50.0",5,1,0,2,"Young Blood"]
[54,"Carl Bilodeau (St-Nic)",90,72,439,"5.27","45.8",-30,2,2,2,"Maiden"]
[55,"Jérôme Tremblay",90,64,436,"5.22","48.4",-6,0,0,0,"Virus Army"]
[56,"Michelle Drolet",90,64,429,"5.23","45.3",-50,2,3,2,"Virus Army"]
[57,"Real Maltais",90,72,418,"5.04","41.7",-65,0,3,0,"Serial Killer"]
[58,"Annie Roux",90,72,412,"5.08","45.8",-41,1,0,1,"Maiden"]
[59,"Martin Lemay",90,72,412,"4.98","41.7",-52,0,1,0,"Les Bikers"]
[60,"Dominique Moffet",90,64,404,"4.94","42.2",-67,0,2,1,"Black Wolves"]
[61,"Patrice Guay",90,56,383,"4.78","41.1",-57,0,0,1,"Les Beaux Seront"]
[62,"John Shea",90,72,376,"4.71","33.3",-98,1,2,1,"Virus Army"]
[63,"Richard Simard",90,48,369,"4.70","39.6",-66,0,1,0,"Virus Army"]
[64,"Simon Poulin",90,64,352,"4.57","37.5",-106,0,1,0,"Maiden"]
[65,"Dominique Allaire",90,64,327,"4.35","32.8",-128,0,0,0,"The Gentlemen"]
[66,"Mélissa Tanguay",90,64,319,"4.24","28.1",-150,0,3,0,"Les Assoiffés du billard"]
[67,"Stéphane Boisclair",90,72,312,"4.19","30.6",-174,0,3,0,"Les Bikers"]
[68,"Nathalie Bédard",90,72,310,"4.20","31.9",-163,0,2,0,"Kin Toé"]
[69,"Tony Tache",100,32,309,"4.23","31.3",-68,0,0,0,"On revient avec ça"]
[70,"Naomy St-Louis",100,32,251,"3.61","21.9",-89,0,0,0,"On revient avec ça"]
[71,"Maude Lacoursière",100,56,181,"3.10","14.3",-245,0,3,0,"L'équipe à Pat"]
[72,"David Petit",90,72,473,"5.53","50.0",-1,3,2,4,"Les Panzers"]

{"sheet":"Papier","index":1,"n_rows":73,"n_cols":6,"rows_kept":73,"cut":false,"hidden":true,"merged":[[2,1,6,2]]}
[null,"Indiquez votre nom dans la case Personne sondée.",null,null,"Joueur","Rang 1 à 72"]
[null,null,null,null,"Alain Martel"]
[null,"Déléguez cinq joueurs qui ne font pas partie de votre équipe à qui vous feriez confiance pour faire partie du comité de cotation. ",null,null,"Alexandre Laroche"]
[null,null,null,null,"André Nadeau"]
[null,null,null,null,"Annie Roux"]
[null,null,null,null,"Audrey Girard-Gagnon"]
[null,null,null,null,"Carl Bilodeau (St-Nic)"]
[null,"Personne sondée",null,null,"Claude Tardif"]
[null,null,null,null,"Daniel Bujold"]
[null,null,null,null,"Daniel Gauthier"]
[null,"Joueur #1",null,null,"Dany Trépanier"]
[null,null,null,null,"Dave Beaulieu"]
[null,"Joueur #2",null,null,"Dave-Tom Gosselin"]
[null,null,null,null,"David Petit"]
[null,"Joueur #3",null,null,"Denis Légaré"]
[null,null,null,null,"Denis Roy"]
[null,"Joueur #4",null,null,"Denise Paquin (St-Henri)"]
[null,null,null,null,"Dominique Allaire"]
[null,"Joueur #5",null,null,"Dominique Moffet"]
[null,null,null,null,"Frédéric Vallières"]
[null,null,null,null,"Garry Conroy"]
[null,null,null,null,"Gilles Rousseau"]
[null,null,null,null,"Guy Boivin"]
[null,null,null,null,"Isabelle Nadeau"]
[null,null,null,null,"Jean Metivier"]
[null,null,null,null,"Jean-Philippe Langlois"]
[null,null,null,null,"Jean-Philippe Ross"]
[null,null,null,null,"Jérôme Tremblay"]
[null,null,null,null,"Jocelyn Laperrière"]
[null,null,null,null,"John Shea"]
[null,null,null,null,"Jordan Cayer"]
[null,null,null,null,"Julien Petitclerc"]
[null,null,null,null,"Manon Huet"]
[null,null,null,null,"Marco Lehoux"]
[null,null,null,null,"Marco Raby"]
[null,null,null,null,"Marie-Noël Naud"]
[null,null,null,null,"Mariline Boutet"]
[null,null,null,null,"Martin Conroy"]
[null,null,null,null,"Martin Lemay"]
[null,null,null,null,"Martin Lemieux"]
[null,null,null,null,"Martin Villeneuve"]
[null,null,null,null,"Maude Lacoursière"]
[null,null,null,null,"Maxime Larochelle-Tardif"]
[null,null,null,null,"Mélanie Roussin"]
[null,null,null,null,"Mélissa Tanguay"]
[null,null,null,null,"Michel Belley"]
[null,null,null,null,"Michel Bergeron"]
[null,null,null,null,"Michelle Drolet"]
[null,null,null,null,"Mickael Savard"]
[null,null,null,null,"Naomy St-Louis"]
[null,null,null,null,"Nathalie Bédard"]
[null,null,null,null,"Nelson Dubois"]
[null,null,null,null,"Pascal Gravel"]
[null,null,null,null,"Pascal St-Louis"]
[null,null,null,null,"Patrice Guay"]
[null,null,null,null,"Patrick Giroux"]
[null,null,null,null,"Patrick Saindon"]
[null,null,null,null,"Pierre Lemay"]
[null,null,null,null,"Réal Jobin"]
[null,null,null,null,"Real Maltais"]
[null,null,null,null,"Richard Simard"]
[null,null,null,null,"Rita Fortin"]
[null,null,null,null,"Samuel Paquet"]
[null,null,null,null,"Sébastien Picard (Québec)"]
[null,null,null,null,"Sébastien Touchette"]
[null,null,null,null,"Simon Poulin"]
[null,null,null,null,"Stéphane Boisclair"]
[null,null,null,null,"Stéphane Desroches"]
[null,null,null,null,"Stéphane Laliberté"]
[null,null,null,null,"Steve Lebrasseur"]
[null,null,null,null,"Sylvain Bernard"]
[null,null,null,null,"Tony Tache"]
[null,null,null,null,"Yves Picard"]

{"sheet":"Pilotage","index":2,"n_rows":152,"n_cols":14,"rows_kept":152,"cut":false,"hidden":true,"merged":[[3,0,3,11]]}
["SheetChange",null,null,null,null,"Version",null,null,null,null,"Fichier vierge",null,null,"Nom Fichier"]
[true,null,null,null,null,14,null,null,null,null,true,null,null,"Cotation_VIERGE_GTA"]
[]
["CLASSEMENT"]
["Joueur","TRS","PJ","IPS","FP","% VIC","DIFF","ERO","EC","TVP","Équipe","Statut"]
["Patrick Giroux",60,64,639,"7.03","70.3",182,7,0,8,"The Gentlemen",{"$f":"IF(K6=\"Substitut\",\"S\",\"R\")","v":"R"}]
["Samuel Paquet",60,56,629,"6.94","67.9",118,6,2,7,"Maiden",{"$f":"IF(K7=\"Substitut\",\"S\",\"R\")","v":"R"}]
["Réal Jobin",60,64,574,"6.41","57.8",101,5,3,6,"L'équipe à Pat",{"$f":"IF(K8=\"Substitut\",\"S\",\"R\")","v":"R"}]
["Pascal St-Louis",60,72,508,"5.84","56.9",45,2,2,2,"On revient avec ça",{"$f":"IF(K9=\"Substitut\",\"S\",\"R\")","v":"R"}]
["Sébastien Picard (Québec)",70,64,692,"7.52","76.6",213,8,1,8,"Young Blood",{"$f":"IF(K10=\"Substitut\",\"S\",\"R\")","v":"R"}]
["Rita Fortin",70,40,636,"6.97","72.5",110,2,1,2,"Les Bikers",{"$f":"IF(K11=\"Substitut\",\"S\",\"R\")","v":"R"}]
["Michel Bergeron",70,72,579,"6.46","61.1",109,6,2,8,"Les Bikers",{"$f":"IF(K12=\"Substitut\",\"S\",\"R\")","v":"R"}]
["Dave-Tom Gosselin",70,72,561,"6.29","63.9",113,2,1,2,"Kin Toé",{"$f":"IF(K13=\"Substitut\",\"S\",\"R\")","v":"R"}]
["Marco Lehoux",70,72,560,"6.31","61.1",85,3,2,5,"Les Beaux Seront",{"$f":"IF(K14=\"Substitut\",\"S\",\"R\")","v":"R"}]
["Frédéric Vallières",70,72,530,"6.13","55.6",32,2,5,2,"Les Assoiffés du billard",{"$f":"IF(K15=\"Substitut\",\"S\",\"R\")","v":"R"}]
["Gilles Rousseau",70,72,516,"5.98","58.3",56,1,3,2,"Team Marvel",{"$f":"IF(K16=\"Substitut\",\"S\",\"R\")","v":"R"}]
["Jean Metivier",70,64,495,"5.80","51.6",23,3,2,4,"Les Beaux Seront",{"$f":"IF(K17=\"Substitut\",\"S\",\"R\")","v":"R"}]
["Martin Villeneuve",70,72,493,"5.75","51.4",30,4,2,4,"Isa et ses requins",{"$f":"IF(K18=\"Substitut\",\"S\",\"R\")","v":"R"}]
["Stéphane Desroches",70,64,481,"5.58","51.6",17,1,2,2,"Black Wolves",{"$f":"IF(K19=\"Substitut\",\"S\",\"R\")","v":"R"}]
["Guy Boivin",70,72,465,"5.51","50.0",8,2,2,2,"Serial Killer",{"$f":"IF(K20=\"Substitut\",\"S\",\"R\")","v":"R"}]
["Patrick Saindon",70,40,431,"5.27","47.5",-19,1,1,1,"On revient avec ça",{"$f":"IF(K21=\"Substitut\",\"S\",\"R\")","v":"R"}]
["Sébastien Touchette",80,64,659,"7.30","70.3",166,8,3,8,"Black Wolves",{"$f":"IF(K22=\"Substitut\",\"S\",\"R\")","v":"R"}]
["Yves Picard",80,48,602,"6.72","70.8",106,2,0,3,"Young Blood",{"$f":"IF(K23=\"Substitut\",\"S\",\"R\")","v":"R"}]
["Dave Beaulieu",80,64,586,"6.67","67.2",112,5,1,5,"Attache ta tuque",{"$f":"IF(K24=\"Substitut\",\"S\",\"R\")","v":"R"}]
["Daniel Bujold",80,72,571,"6.39","63.9",117,2,2,2,"Black Wolves",{"$f":"IF(K25=\"Substitut\",\"S\",\"R\")","v":"R"}]
["Jocelyn Laperrière",80,72,536,"6.14","58.3",80,3,2,3,"Attache ta tuque",{"$f":"IF(K26=\"Substitut\",\"S\",\"R\")","v":"R"}]
["Audrey Girard-Gagnon",80,64,533,"6.14","62.5",54,1,2,1,"Les Sans Carlito",{"$f":"IF(K27=\"Substitut\",\"S\",\"R\")","v":"R"}]
["Marco Raby",80,72,524,"5.93","56.9",51,2,2,3,"Les Panzers",{"$f":"IF(K28=\"Substitut\",\"S\",\"R\")","v":"R"}]
["Maxime Larochelle-Tardif",80,72,513,"5.93","56.9",38,1,4,1,"Sortie 274",{"$f":"IF(K29=\"Substitut\",\"S\",\"R\")","v":"R"}]
["Pascal Gravel",80,72,492,"5.85","54.2",20,2,3,2,"Team Marvel",{"$f":"IF(K30=\"Substitut\",\"S\",\"R\")","v":"R"}]
["Garry Conroy",80,72,483,"5.69","54.2",34,2,0,2,"Les Assoiffés du billard",{"$f":"IF(K31=\"Substitut\",\"S\",\"R\")","v":"R"}]
["Jean-Philippe Langlois",80,64,480,"5.63","53.1",21,0,2,0,"Kin Toé",{"$f":"IF(K32=\"Substitut\",\"S\",\"R\")","v":"R"}]
["Julien Petitclerc",80,72,480,"5.68","50.0",13,4,2,4,"Attache ta tuque",{"$f":"IF(K33=\"Substitut\",\"S\",\"R\")","v":"R"}]
["Denis Roy",80,64,468,"5.58","53.1",0,1,2,1,"The Gentlemen",{"$f":"IF(K34=\"Substitut\",\"S\",\"R\")","v":"R"}]
["Mélanie Roussin",80,56,466,"5.44","48.2",-3,2,1,2,"Les Sans Carlito",{"$f":"IF(K35=\"Substitut\",\"S\",\"R\")","v":"R"}]
["Michel Belley",80,16,451,"5.34","50.0",2,0,0,0,"Young Blood",{"$f":"IF(K36=\"Substitut\",\"S\",\"R\")","v":"R"}]
["Jean-Philippe Ross",80,64,446,"5.41","50.0",-16,1,2,1,"Team Marvel",{"$f":"IF(K37=\"Substitut\",\"S\",\"R\")","v":"R"}]
["Isabelle Nadeau",80,64,442,"5.30","45.3",-22,1,2,1,"Isa et ses requins",{"$f":"IF(K38=\"Substitut\",\"S\",\"R\")","v":"R"}]
["André Nadeau",80,72,437,"5.27","45.8",-46,2,4,2,"Attache ta tuque",{"$f":"IF(K39=\"Substitut\",\"S\",\"R\")","v":"R"}]
["Sylvain Bernard",80,56,436,"5.27","44.6",-35,2,3,2,"Serial Killer",{"$f":"IF(K40=\"Substitut\",\"S\",\"R\")","v":"R"}]
["Alexandre Laroche",80,72,435,"5.24","44.4",-38,2,2,3,"Isa et ses requins",{"$f":"IF(K41=\"Substitut\",\"S\",\"R\")","v":"R"}]
["Alain Martel",80,56,432,"5.26","44.6",-37,1,2,1,"Sortie 274",{"$f":"IF(K42=\"Substitut\",\"S\",\"R\")","v":"R"}]
["Denis Légaré",80,72,422,"5.10","44.4",-67,0,4,1,"Sortie 274",{"$f":"IF(K43=\"Substitut\",\"S\",\"R\")","v":"R"}]
["Mickael Savard",80,72,399,"5.00","41.7",-77,1,3,1,"Les Panzers",{"$f":"IF(K44=\"Substitut\",\"S\",\"R\")","v":"R"}]
["Manon Huet",80,56,389,"4.88","41.1",-57,1,1,1,"Les Sans Carlito",{"$f":"IF(K45=\"Substitut\",\"S\",\"R\")","v":"R"}]
["Martin Conroy",80,72,381,"4.83","40.3",-83,1,0,1,"Les Assoiffés du billard",{"$f":"IF(K46=\"Substitut\",\"S\",\"R\")","v":"R"}]
["Claude Tardif",80,56,374,"4.77","37.5",-92,0,4,0,"Sortie 274",{"$f":"IF(K47=\"Substitut\",\"S\",\"R\")","v":"R"}]
["Nelson Dubois",80,56,364,"4.61","32.1",-102,0,3,0,"Serial Killer",{"$f":"IF(K48=\"Substitut\",\"S\",\"R\")","v":"R"}]
["Steve Lebrasseur",80,64,351,"4.55","32.8",-101,1,1,1,"L'équipe à Pat",{"$f":"IF(K49=\"Substitut\",\"S\",\"R\")","v":"R"}]
["Stéphane Laliberté",90,72,567,"6.44","62.5",86,3,4,4,"Isa et ses requins",{"$f":"IF(K50=\"Substitut\",\"S\",\"R\")","v":"R"}]
["Martin Lemieux",90,48,519,"5.89","56.3",32,2,1,3,"Les Beaux Seront",{"$f":"IF(K51=\"Substitut\",\"S\",\"R\")","v":"R"}]
["Mariline Boutet",90,64,507,"5.98","54.7",18,3,3,3,"On revient avec ça","R"]
["Denise Paquin (St-Henri)",90,40,480,"5.74","50.0",23,1,0,1,"Les Sans Carlito","R"]
["David Petit",90,72,473,"5.53","50.0",-1,3,2,4,"Les Panzers","R"]
["Dany Trépanier",90,64,470,"5.71","46.9",-39,3,6,3,"L'équipe à Pat","R"]
["Marie-Noël Naud",90,72,468,"5.52","51.4",4,0,2,0,"Kin Toé","R"]
["Pierre Lemay",90,64,465,"5.50","51.6",1,0,2,0,"Team Marvel","R"]
["Daniel Gauthier",90,72,459,"5.46","50.0",5,1,2,1,"The Gentlemen","R"]
["Jordan Cayer",90,72,450,"5.20","50.0",5,1,0,2,"Young Blood","R"]
["Carl Bilodeau (St-Nic)",90,72,439,"5.27","45.8",-30,2,2,2,"Maiden","R"]
["Jérôme Tremblay",90,64,436,"5.22","48.4",-6,0,0,0,"Virus Army","R"]
["Michelle Drolet",90,64,429,"5.23","45.3",-50,2,3,2,"Virus Army","R"]
["Real Maltais",90,72,418,"5.04","41.7",-65,0,3,0,"Serial Killer","R"]
["Annie Roux",90,72,412,"5.08","45.8",-41,1,0,1,"Maiden","R"]
["Martin Lemay",90,72,412,"4.98","41.7",-52,0,1,0,"Les Bikers","R"]
["Dominique Moffet",90,64,404,"4.94","42.2",-67,0,2,1,"Black Wolves","R"]
["Patrice Guay",90,56,383,"4.78","41.1",-57,0,0,1,"Les Beaux Seront","R"]
["John Shea",90,72,376,"4.71","33.3",-98,1,2,1,"Virus Army","R"]
["Richard Simard",90,48,369,"4.70","39.6",-66,0,1,0,"Virus Army","R"]
["Simon Poulin",90,64,352,"4.57","37.5",-106,0,1,0,"Maiden","R"]
["Dominique Allaire",90,64,327,"4.35","32.8",-128,0,0,0,"The Gentlemen","R"]
["Mélissa Tanguay",90,64,319,"4.24","28.1",-150,0,3,0,"Les Assoiffés du billard","R"]
["Stéphane Boisclair",90,72,312,"4.19","30.6",-174,0,3,0,"Les Bikers","R"]
["Nathalie Bédard",90,72,310,"4.20","31.9",-163,0,2,0,"Kin Toé","R"]
["Tony Tache",100,32,309,"4.23","31.3",-68,0,0,0,"On revient avec ça","R"]
["Naomy St-Louis",100,32,251,"3.61","21.9",-89,0,0,0,"On revient avec ça","R"]
["Maude Lacoursière",100,56,181,"3.10","14.3",-245,0,3,0,"L'équipe à Pat","R"]
[]
[]
["Tous - Alpha",null,null,null,null,null,null,null,null,null,"Réguliers - Alpha"]
["Alain Martel",null,null,null,null,null,null,null,null,null,"Alain Martel"]
["Alexandre Laroche",null,null,null,null,null,null,null,null,null,"Alexandre Laroche"]
["André Nadeau",null,null,null,null,null,null,null,null,null,"André Nadeau"]
["Annie Roux",null,null,null,null,null,null,null,null,null,"Annie Roux"]
["Audrey Girard-Gagnon",null,null,null,null,null,null,null,null,null,"Audrey Girard-Gagnon"]
["Carl Bilodeau (St-Nic)",null,null,null,null,null,null,null,null,null,"Carl Bilodeau (St-Nic)"]
["Claude Tardif",null,null,null,null,null,null,null,null,null,"Claude Tardif"]
["Daniel Bujold",null,null,null,null,null,null,null,null,null,"Daniel Bujold"]
["Daniel Gauthier",null,null,null,null,null,null,null,null,null,"Daniel Gauthier"]
["Dany Trépanier",null,null,null,null,null,null,null,null,null,"Dany Trépanier"]
["Dave Beaulieu",null,null,null,null,null,null,null,null,null,"Dave Beaulieu"]
["Dave-Tom Gosselin",null,null,null,null,null,null,null,null,null,"Dave-Tom Gosselin"]
["David Petit",null,null,null,null,null,null,null,null,null,"David Petit"]
["Denis Légaré",null,null,null,null,null,null,null,null,null,"Denis Légaré"]
["Denis Roy",null,null,null,null,null,null,null,null,null,"Denis Roy"]
["Denise Paquin (St-Henri)",null,null,null,null,null,null,null,null,null,"Denise Paquin (St-Henri)"]
["Dominique Allaire",null,null,null,null,null,null,null,null,null,"Dominique Allaire"]
["Dominique Moffet",null,null,null,null,null,null,null,null,null,"Dominique Moffet"]
["Frédéric Vallières",null,null,null,null,null,null,null,null,null,"Frédéric Vallières"]
["Garry Conroy",null,null,null,null,null,null,null,null,null,"Garry Conroy"]
["Gilles Rousseau",null,null,null,null,null,null,null,null,null,"Gilles Rousseau"]
["Guy Boivin",null,null,null,null,null,null,null,null,null,"Guy Boivin"]
["Isabelle Nadeau",null,null,null,null,null,null,null,null,null,"Isabelle Nadeau"]
["Jean Metivier",null,null,null,null,null,null,null,null,null,"Jean Metivier"]
["Jean-Philippe Langlois",null,null,null,null,null,null,null,null,null,"Jean-Philippe Langlois"]
["Jean-Philippe Ross",null,null,null,null,null,null,null,null,null,"Jean-Philippe Ross"]
["Jérôme Tremblay",null,null,null,null,null,null,null,null,null,"Jérôme Tremblay"]
["Jocelyn Laperrière",null,null,null,null,null,null,null,null,null,"Jocelyn Laperrière"]
["John Shea",null,null,null,null,null,null,null,null,null,"John Shea"]
["Jordan Cayer",null,null,null,null,null,null,null,null,null,"Jordan Cayer"]
["Julien Petitclerc",null,null,null,null,null,null,null,null,null,"Julien Petitclerc"]
["Manon Huet",null,null,null,null,null,null,null,null,null,"Manon Huet"]
["Marco Lehoux",null,null,null,null,null,null,null,null,null,"Marco Lehoux"]
["Marco Raby",null,null,null,null,null,null,null,null,null,"Marco Raby"]
["Marie-Noël Naud",null,null,null,null,null,null,null,null,null,"Marie-Noël Naud"]
["Mariline Boutet",null,null,null,null,null,null,null,null,null,"Mariline Boutet"]
["Martin Conroy",null,null,null,null,null,null,null,null,null,"Martin Conroy"]
["Martin Lemay",null,null,null,null,null,null,null,null,null,"Martin Lemay"]
["Martin Lemieux",null,null,null,null,null,null,null,null,null,"Martin Lemieux"]
["Martin Villeneuve",null,null,null,null,null,null,null,null,null,"Martin Villeneuve"]
["Maude Lacoursière",null,null,null,null,null,null,null,null,null,"Maude Lacoursière"]
["Maxime Larochelle-Tardif",null,null,null,null,null,null,null,null,null,"Maxime Larochelle-Tardif"]
["Mélanie Roussin",null,null,null,null,null,null,null,null,null,"Mélanie Roussin"]
["Mélissa Tanguay",null,null,null,null,null,null,null,null,null,"Mélissa Tanguay"]
["Michel Belley",null,null,null,null,null,null,null,null,null,"Michel Belley"]
["Michel Bergeron",null,null,null,null,null,null,null,null,null,"Michel Bergeron"]
["Michelle Drolet",null,null,null,null,null,null,null,null,null,"Michelle Drolet"]
["Mickael Savard",null,null,null,null,null,null,null,null,null,"Mickael Savard"]
["Naomy St-Louis",null,null,null,null,null,null,null,null,null,"Naomy St-Louis"]
["Nathalie Bédard",null,null,null,null,null,null,null,null,null,"Nathalie Bédard"]
["Nelson Dubois",null,null,null,null,null,null,null,null,null,"Nelson Dubois"]
["Pascal Gravel",null,null,null,null,null,null,null,null,null,"Pascal Gravel"]
["Pascal St-Louis",null,null,null,null,null,null,null,null,null,"Pascal St-Louis"]
["Patrice Guay",null,null,null,null,null,null,null,null,null,"Patrice Guay"]
["Patrick Giroux",null,null,null,null,null,null,null,null,null,"Patrick Giroux"]
["Patrick Saindon",null,null,null,null,null,null,null,null,null,"Patrick Saindon"]
["Pierre Lemay",null,null,null,null,null,null,null,null,null,"Pierre Lemay"]
["Réal Jobin",null,null,null,null,null,null,null,null,null,"Réal Jobin"]
["Real Maltais",null,null,null,null,null,null,null,null,null,"Real Maltais"]
["Richard Simard",null,null,null,null,null,null,null,null,null,"Richard Simard"]
["Rita Fortin",null,null,null,null,null,null,null,null,null,"Rita Fortin"]
["Samuel Paquet",null,null,null,null,null,null,null,null,null,"Samuel Paquet"]
["Sébastien Picard (Québec)",null,null,null,null,null,null,null,null,null,"Sébastien Picard (Québec)"]
["Sébastien Touchette",null,null,null,null,null,null,null,null,null,"Sébastien Touchette"]
["Simon Poulin",null,null,null,null,null,null,null,null,null,"Simon Poulin"]
["Stéphane Boisclair",null,null,null,null,null,null,null,null,null,"Stéphane Boisclair"]
["Stéphane Desroches",null,null,null,null,null,null,null,null,null,"Stéphane Desroches"]
["Stéphane Laliberté",null,null,null,null,null,null,null,null,null,"Stéphane Laliberté"]
["Steve Lebrasseur",null,null,null,null,null,null,null,null,null,"Steve Lebrasseur"]
["Sylvain Bernard",null,null,null,null,null,null,null,null,null,"Sylvain Bernard"]
["Tony Tache",null,null,null,null,null,null,null,null,null,"Tony Tache"]
["Yves Picard",null,null,null,null,null,null,null,null,null,"Yves Picard"]